Target
Amyloid beta-binding alcohol dehydrogenase
Ligand
BDBM232923
Substrate
Meas. Tech.
Inhibition Assay
Ki
96600±19400 nM
Citation
 Yan, SValasani, KR Phosphonate derivatives and methods of use thereof in the treatment of Alzheimer's disease US Patent  US9738668 Publication Date 8/22/2017 
Target
Name:
Amyloid beta-binding alcohol dehydrogenase
Synonyms:
Amyloid beta-binding alcohol dehydrogenase (ABAD)
Type:
Enzyme
Mol. Mass.:
938.17
Organism:
Homo sapiens (Human)
Description:
Q2L8D9
Residue:
9
MAAACRSVK
  
Inhibitor
Name:
BDBM232923
Synonyms:
US9346839, 4 | US9738668, Compound 4
Type:
Small organic molecule
Emp. Form.:
C19H21N2O7PS
Mol. Mass.:
452.418
SMILES:
COC(=O)c1cc(ccc1O)[C@H](Nc1nc2ccc(OC)cc2s1)P(=O)(OC)OC
: