Target
Kallikrein-7
Ligand
BDBM336206
Substrate
Meas. Tech.
Inhibition Assay
IC50
3260±n/a nM
Citation
 Linschoten, M Kallikrein 7 inhibitors US Patent  US9744148 Publication Date 8/29/2017 
Target
Name:
Kallikrein-7
Synonyms:
KLK7 Kallikrein 7 PRSS6 Serine protease 6 hK7 kallikrein-7 isoform 1 preproprotein
Type:
PROTEIN
Mol. Mass.:
27535.05
Organism:
Homo sapiens (Human)
Description:
ChEMBL_1469257
Residue:
253
  
Inhibitor
Name:
BDBM336206
Synonyms:
US9744148, 75
Type:
Small organic molecule
Emp. Form.:
C24H25N3O5
Mol. Mass.:
435.4724
SMILES:
CC(C)C(OC(=O)C(NC(=O)c1ccccc1)c1ccccc1)C(=O)Nc1cc(C)on1
: