Target
Kallikrein-7
Ligand
BDBM336223
Substrate
Meas. Tech.
Inhibition Assay
IC50
3800±n/a nM
Citation
 Linschoten, M Kallikrein 7 inhibitors US Patent  US9744148 Publication Date 8/29/2017 
Target
Name:
Kallikrein-7
Synonyms:
KLK7 Kallikrein 7 PRSS6 Serine protease 6 hK7 kallikrein-7 isoform 1 preproprotein
Type:
PROTEIN
Mol. Mass.:
27535.05
Organism:
Homo sapiens (Human)
Description:
ChEMBL_1469257
Residue:
253
  
Inhibitor
Name:
BDBM336223
Synonyms:
US9744148, 92
Type:
Small organic molecule
Emp. Form.:
C20H22ClNO4
Mol. Mass.:
375.846
SMILES:
COc1ccc(NC(=O)C(OC(=O)Cc2ccc(Cl)cc2)C(C)C)cc1
: