Target
Tyrosine-protein kinase Mer
Ligand
BDBM336268
Substrate
Meas. Tech.
Inhibition Assay
IC50
<10±n/a nM
Citation
 Wang, XLiu, JYang, CZhang, WFrye, SKireev, D Pyrazolopyrimidine compounds for the treatment of cancer US Patent  US9744172 Publication Date 8/29/2017 
Target
Name:
Tyrosine-protein kinase Mer
Synonyms:
MER MERTK Proto-oncogene c-Mer Receptor tyrosine kinase MerTK | Tyrosine-protein kinase Mer
Type:
PROTEIN
Mol. Mass.:
110234.77
Organism:
Homo sapiens (Human)
Description:
ChEMBL_1498723
Residue:
999
  
Inhibitor
Name:
BDBM336268
Synonyms:
US9744172, Compound UNC608A
Type:
Small organic molecule
Emp. Form.:
C31H39N7O
Mol. Mass.:
525.6877
SMILES:
N[C@H]1CC[C@H](Cn2nc(-c3ccc(cc3)N3CCOCC3)c3cnc(NCCCc4ccccc4)nc23)CC1
: