Target
Tyrosine-protein kinase Mer
Ligand
BDBM336293
Substrate
Meas. Tech.
Inhibition Assay
IC50
20000±n/a nM
Citation
 Wang, XLiu, JYang, CZhang, WFrye, SKireev, D Pyrazolopyrimidine compounds for the treatment of cancer US Patent  US9744172 Publication Date 8/29/2017 
Target
Name:
Tyrosine-protein kinase Mer
Synonyms:
MER MERTK Proto-oncogene c-Mer Receptor tyrosine kinase MerTK | Tyrosine-protein kinase Mer
Type:
PROTEIN
Mol. Mass.:
110234.77
Organism:
Homo sapiens (Human)
Description:
ChEMBL_1498723
Residue:
999
  
Inhibitor
Name:
BDBM336293
Synonyms:
US9744172, Compound UNC00000264A
Type:
Small organic molecule
Emp. Form.:
C17H20N6
Mol. Mass.:
308.3809
SMILES:
CNc1ncc2c(nn(CC3CCCN3)c2n1)-c1ccccc1
: