Target
Tyrosine-protein kinase Mer
Ligand
BDBM336333
Substrate
Meas. Tech.
Inhibition Assay
IC50
<10±n/a nM
Citation
 Wang, XLiu, JYang, CZhang, WFrye, SKireev, D Pyrazolopyrimidine compounds for the treatment of cancer US Patent  US9744172 Publication Date 8/29/2017 
Target
Name:
Tyrosine-protein kinase Mer
Synonyms:
MER MERTK Proto-oncogene c-Mer Receptor tyrosine kinase MerTK | Tyrosine-protein kinase Mer
Type:
PROTEIN
Mol. Mass.:
110234.77
Organism:
Homo sapiens (Human)
Description:
ChEMBL_1498723
Residue:
999
  
Inhibitor
Name:
BDBM336333
Synonyms:
US9744172, Compound UNC00000551A
Type:
Small organic molecule
Emp. Form.:
C26H30N6
Mol. Mass.:
426.5566
SMILES:
Cc1ccc(CNc2ncc3c(nn(CC4CCC(N)CC4)c3n2)-c2ccccc2)cc1
: