Target
Orexin/Hypocretin receptor type 1
Ligand
BDBM336772
Substrate
Meas. Tech.
FLIPR Ca2+ Flux Assay
IC50
2142±n/a nM
Citation
 Kuduk, SDSkudlarek, JW 2-pyridyloxy-4-ether orexin receptor antagonists US Patent  US9745284 Publication Date 8/29/2017 
Target
Name:
Orexin/Hypocretin receptor type 1
Synonyms:
HCRTR1 OX1R_HUMAN Orexin receptor type 1 (OR 1) Orexin receptor type 1 (OX1) Orexin receptor type 1 (OxR1) | Ox1r
Type:
Protein
Mol. Mass.:
47554.50
Organism:
Homo sapiens (Human)
Description:
O43613
Residue:
425
  
Inhibitor
Name:
BDBM336772
Synonyms:
4-(2,2-difluoroethoxy)-2- {[(3R,6R)-1-{[3-fluoro-2- (2H-1,2,3-triazol-2- yl)phenyl]carbonyl}-6- methylpiperidin-3- yl]oxy}pyridine | US9745284, 34
Type:
Small organic molecule
Emp. Form.:
C22H22F3N5O3
Mol. Mass.:
461.437
SMILES:
C[C@@H]1CC[C@H](CN1C(=O)c1cccc(F)c1-n1nccn1)Oc1cc(OCC(F)F)ccn1
: