Target
Orexin receptor type 2
Ligand
BDBM336789
Substrate
Meas. Tech.
FLIPR Ca2+ Flux Assay
IC50
8.00±n/a nM
Citation
 Kuduk, SDSkudlarek, JW 2-pyridyloxy-4-ether orexin receptor antagonists US Patent  US9745284 Publication Date 8/29/2017 
Target
Name:
Orexin receptor type 2
Synonyms:
HCRTR2 OX2R_HUMAN Orexin receptor type 2 (OR-2) Orexin receptor type 2 (OX2R) Ox-2-R | Ox2-R
Type:
Protein
Mol. Mass.:
50710.53
Organism:
Homo sapiens (Human)
Description:
O43614
Residue:
444
  
Inhibitor
Name:
BDBM336789
Synonyms:
(2-(2H-1,2,3-Triazol-2-yl)phenyl)((2R,5R)-5-((4-(fluoromethoxy)pyridin-2-yl)oxy)-2-methylpiperidin-1-yl)methanone | US9745284, 53
Type:
Small organic molecule
Emp. Form.:
C21H22FN5O3
Mol. Mass.:
411.4295
SMILES:
C[C@@H]1CC[C@H](CN1C(=O)c1ccccc1-n1nccn1)Oc1cc(OCF)ccn1
: