Target
11-beta-hydroxysteroid dehydrogenase 1
Ligand
BDBM13771
Substrate
BDBM13739
Meas. Tech.
Human and Mouse 11beta-HSD1 SPA Assay
IC50
210±n/a nM
Citation
 Patel, JRShuai, QDinges, JWinn, MPliushchev, MFung, SMonzon, KChiou, WWang, JPan, LWagaw, SEngstrom, KKerdesky, FALongenecker, KJudge, RQin, WImade, HMStolarik, DBeno, DWBrune, MChovan, LESham, HLJacobson, PLink, JT Discovery of adamantane ethers as inhibitors of 11beta-HSD-1: Synthesis and biological evaluation. Bioorg Med Chem Lett 17:750-5 (2007)  
Target
Name:
11-beta-hydroxysteroid dehydrogenase 1
Synonyms:
11-DH 11-beta-Hydroxysteroid Dehydrogenase 1 (11-beta-HSD1) 11beta-HSD1A Corticosteroid 11-beta-dehydrogenase isozyme 1 (11-beta-HSD-1) Hsd11 | Hsd11b1
Type:
Enzyme
Mol. Mass.:
32369.70
Organism:
Mus musculus (mouse)
Description:
P50172
Residue:
292
  
Inhibitor
Name:
BDBM13771
Synonyms:
2-{[(1R,3R,4S,7S)-4-[2-(4-chlorophenoxy)-2-methylpropanamido]adamantan-1-yl]methoxy}acetic acid | adamantane ether 25
Type:
Small organic molecule
Emp. Form.:
C23H30ClNO5
Mol. Mass.:
435.941
SMILES:
CC(C)(Oc1ccc(Cl)cc1)C(=O)N[C@H]1C2C[C@@H]3C[C@@H]1C[C@](COCC(O)=O)(C3)C2
:
Substrate
Name:
BDBM13739
Synonyms:
(1S,2R,10S,11S,14R,15S)-14-hydroxy-14-(2-hydroxyacetyl)-2,15-dimethyltetracyclo[8.7.0.0^{2,7}.0^{11,15}]heptadec-6-ene-5,17-dione [3H]cortisone | cortisone
Type:
Steroid
Emp. Form.:
C21H28O5
Mol. Mass.:
360.444
SMILES:
[H][C@@]12CC[C@](O)(C(=O)CO)[C@@]1(C)CC(=O)[C@@]1([H])[C@@]2([H])CCC2=CC(=O)CC[C@]12C
: