Target
D-amino-acid oxidase
Ligand
BDBM337632
Substrate
Meas. Tech.
Enzyme Assay
IC50
4100±n/a nM
Citation
 Farnaby, WFieldhouse, CHazel, KKerr, CKinsella, NLivermore, DMerchant, KMiller, D Pyridazinones as DAAO enzyme inhibitors US Patent  US9750748 Publication Date 9/5/2017 
Target
Name:
D-amino-acid oxidase
Synonyms:
D-amino-acid oxidase (DAAO) DAMOX OXDA_HUMAN
Type:
Homodimer
Mol. Mass.:
39476.06
Organism:
Homo sapiens (Human)
Description:
P14920
Residue:
347
  
Inhibitor
Name:
BDBM337632
Synonyms:
4-Hydroxy-6-(tetrahydro-2H-pyran-4-yl)pyridazin-3(2H)-one | US9750748, 4
Type:
Small organic molecule
Emp. Form.:
C9H12N2O3
Mol. Mass.:
196.2032
SMILES:
Oc1cc(n[nH]c1=O)C1CCOCC1
: