Target
D-amino-acid oxidase
Ligand
BDBM337633
Substrate
Meas. Tech.
Enzyme Assay
IC50
140±n/a nM
Citation
 Farnaby, WFieldhouse, CHazel, KKerr, CKinsella, NLivermore, DMerchant, KMiller, D Pyridazinones as DAAO enzyme inhibitors US Patent  US9750748 Publication Date 9/5/2017 
Target
Name:
D-amino-acid oxidase
Synonyms:
D-amino-acid oxidase (DAAO) DAMOX OXDA_HUMAN
Type:
Homodimer
Mol. Mass.:
39476.06
Organism:
Homo sapiens (Human)
Description:
P14920
Residue:
347
  
Inhibitor
Name:
BDBM337633
Synonyms:
4-Hydroxy-6-(2-methylpropyl)pyridazin-3(2H)-one | US9750748, 5
Type:
Small organic molecule
Emp. Form.:
C8H12N2O2
Mol. Mass.:
168.1931
SMILES:
CC(C)Cc1cc(O)c(=O)[nH]n1
: