Target
D-amino-acid oxidase
Ligand
BDBM337635
Substrate
Meas. Tech.
Enzyme Assay
IC50
1100±n/a nM
Citation
 Farnaby, WFieldhouse, CHazel, KKerr, CKinsella, NLivermore, DMerchant, KMiller, D Pyridazinones as DAAO enzyme inhibitors US Patent  US9750748 Publication Date 9/5/2017 
Target
Name:
D-amino-acid oxidase
Synonyms:
D-amino-acid oxidase (DAAO) DAMOX OXDA_HUMAN
Type:
Homodimer
Mol. Mass.:
39476.06
Organism:
Homo sapiens (Human)
Description:
P14920
Residue:
347
  
Inhibitor
Name:
BDBM337635
Synonyms:
6-Cyclohexyl-4-hydroxypyridazin-3(2H)-one US9750748, 7
Type:
Small organic molecule
Emp. Form.:
C10H14N2O2
Mol. Mass.:
194.2304
SMILES:
Oc1cc(n[nH]c1=O)C1CCCCC1
: