Target
D-amino-acid oxidase
Ligand
BDBM337636
Substrate
Meas. Tech.
Enzyme Assay
IC50
36.0±n/a nM
Citation
 Farnaby, WFieldhouse, CHazel, KKerr, CKinsella, NLivermore, DMerchant, KMiller, D Pyridazinones as DAAO enzyme inhibitors US Patent  US9750748 Publication Date 9/5/2017 
Target
Name:
D-amino-acid oxidase
Synonyms:
D-amino-acid oxidase (DAAO) DAMOX OXDA_HUMAN
Type:
Homodimer
Mol. Mass.:
39476.06
Organism:
Homo sapiens (Human)
Description:
P14920
Residue:
347
  
Inhibitor
Name:
BDBM337636
Synonyms:
4-Hydroxy-6-isopropylpyridazin-3(2H)-one | US9750748, 8
Type:
Small organic molecule
Emp. Form.:
C7H10N2O2
Mol. Mass.:
154.1665
SMILES:
CC(C)c1cc(O)c(=O)[nH]n1
: