Target
D-amino-acid oxidase
Ligand
BDBM337638
Substrate
Meas. Tech.
Enzyme Assay
IC50
46.0±n/a nM
Citation
 Farnaby, WFieldhouse, CHazel, KKerr, CKinsella, NLivermore, DMerchant, KMiller, D Pyridazinones as DAAO enzyme inhibitors US Patent  US9750748 Publication Date 9/5/2017 
Target
Name:
D-amino-acid oxidase
Synonyms:
D-amino-acid oxidase (DAAO) DAMOX OXDA_HUMAN
Type:
Homodimer
Mol. Mass.:
39476.06
Organism:
Homo sapiens (Human)
Description:
P14920
Residue:
347
  
Inhibitor
Name:
BDBM337638
Synonyms:
6-(Dimethylamino)-4-hydroxypyridazin-3(2H)-one | US9750748, 10
Type:
Small organic molecule
Emp. Form.:
C6H9N3O2
Mol. Mass.:
155.1546
SMILES:
CN(C)c1cc(O)c(=O)[nH]n1
: