Target
Histone deacetylase 6
Ligand
BDBM337645
Substrate
Meas. Tech.
Inhibition Assay
IC50
139±27 nM
Citation
 Sotomayor, EMBergman, JAKozikowski, APVillagra, AVWoan, KV Selective histone deactylase 6 inhibitors US Patent  US9751832 Publication Date 9/5/2017 
Target
Name:
Histone deacetylase 6
Synonyms:
Cereblon/Histone deacetylase 6 HDAC6 Histone deacetylase 6 (HDAC6) KIAA0901 | ORF Names:JM21
Type:
Chromatin regulator; hydrolase; repressor
Mol. Mass.:
131381.51
Organism:
Homo sapiens (Human)
Description:
Q9UBN7
Residue:
1215
  
Inhibitor
Name:
BDBM337645
Synonyms:
US10227295, Compound 1 | US9751832, Compound 1
Type:
Small organic molecule
Emp. Form.:
C16H17N3O3
Mol. Mass.:
299.3245
SMILES:
COc1ccccc1NC(=O)NCc1ccc(cc1)C(N)=O
: