Target
Histone deacetylase 1
Ligand
BDBM50398724
Substrate
Meas. Tech.
Inhibition Assay
IC50
8950±770 nM
Citation
 Sotomayor, EMBergman, JAKozikowski, APVillagra, AVWoan, KV Selective histone deactylase 6 inhibitors US Patent  US9751832 Publication Date 9/5/2017 
Target
Name:
Histone deacetylase 1
Synonyms:
Cereblon/Histone deacetylase 1 HDAC1 Histone deacetylase 1 (HDAC1) RPD3L1
Type:
Enzyme
Mol. Mass.:
55090.27
Organism:
Homo sapiens (Human)
Description:
Q13547
Residue:
482
  
Inhibitor
Name:
BDBM50398724
Synonyms:
CHEMBL2179250 US9409858, 5c US9956192, Compound 5c
Type:
Small organic molecule
Emp. Form.:
C26H26N4O4
Mol. Mass.:
458.509
SMILES:
COc1ccccc1NC(=O)N(CCc1c[nH]c2ccccc12)Cc1ccc(cc1)C(=O)NO
: