Target
Histone deacetylase 1
Ligand
BDBM50398723
Substrate
Meas. Tech.
Inhibition Assay
IC50
1690±120 nM
Citation
 Sotomayor, EMBergman, JAKozikowski, APVillagra, AVWoan, KV Selective histone deactylase 6 inhibitors US Patent  US9751832 Publication Date 9/5/2017 
Target
Name:
Histone deacetylase 1
Synonyms:
Cereblon/Histone deacetylase 1 HDAC1 Histone deacetylase 1 (HDAC1) RPD3L1
Type:
Enzyme
Mol. Mass.:
55090.27
Organism:
Homo sapiens (Human)
Description:
Q13547
Residue:
482
  
Inhibitor
Name:
BDBM50398723
Synonyms:
CHEMBL2179615 US9409858, 5d US9956192, Compound 5d
Type:
Small organic molecule
Emp. Form.:
C24H25N3O5
Mol. Mass.:
435.4724
SMILES:
COc1ccccc1NC(=O)N(CCc1ccc(O)cc1)Cc1ccc(cc1)C(=O)NO
: