Target
Histone deacetylase 1
Ligand
BDBM50398716
Substrate
Meas. Tech.
Inhibition Assay
IC50
3020±740 nM
Citation
 Sotomayor, EMBergman, JAKozikowski, APVillagra, AVWoan, KV Selective histone deactylase 6 inhibitors US Patent  US9751832 Publication Date 9/5/2017 
Target
Name:
Histone deacetylase 1
Synonyms:
Cereblon/Histone deacetylase 1 HDAC1 Histone deacetylase 1 (HDAC1) RPD3L1
Type:
Enzyme
Mol. Mass.:
55090.27
Organism:
Homo sapiens (Human)
Description:
Q13547
Residue:
482
  
Inhibitor
Name:
BDBM50398716
Synonyms:
CHEMBL2179618 US9409858, 5g US9956192, Compound 5g
Type:
Small organic molecule
Emp. Form.:
C19H23N3O3
Mol. Mass.:
341.4042
SMILES:
CCCCN(Cc1ccc(cc1)C(=O)NO)C(=O)Nc1ccccc1
: