Target
Histone deacetylase 6
Ligand
BDBM50398716
Substrate
Meas. Tech.
Inhibition Assay
IC50
5.02±0.060 nM
Citation
 Sotomayor, EMBergman, JAKozikowski, APVillagra, AVWoan, KV Selective histone deactylase 6 inhibitors US Patent  US9751832 Publication Date 9/5/2017 
Target
Name:
Histone deacetylase 6
Synonyms:
Cereblon/Histone deacetylase 6 HDAC6 Histone deacetylase 6 (HDAC6) KIAA0901 | ORF Names:JM21
Type:
Chromatin regulator; hydrolase; repressor
Mol. Mass.:
131381.51
Organism:
Homo sapiens (Human)
Description:
Q9UBN7
Residue:
1215
  
Inhibitor
Name:
BDBM50398716
Synonyms:
CHEMBL2179618 US9409858, 5g US9956192, Compound 5g
Type:
Small organic molecule
Emp. Form.:
C19H23N3O3
Mol. Mass.:
341.4042
SMILES:
CCCCN(Cc1ccc(cc1)C(=O)NO)C(=O)Nc1ccccc1
: