Target
Histone deacetylase 6
Ligand
BDBM50398720
Substrate
Meas. Tech.
Inhibition Assay
IC50
14.0±0.75 nM
Citation
 Sotomayor, EMBergman, JAKozikowski, APVillagra, AVWoan, KV Selective histone deactylase 6 inhibitors US Patent  US9751832 Publication Date 9/5/2017 
Target
Name:
Histone deacetylase 6
Synonyms:
Cereblon/Histone deacetylase 6 HDAC6 Histone deacetylase 6 (HDAC6) KIAA0901 | ORF Names:JM21
Type:
Chromatin regulator; hydrolase; repressor
Mol. Mass.:
131381.51
Organism:
Homo sapiens (Human)
Description:
Q9UBN7
Residue:
1215
  
Inhibitor
Name:
BDBM50398720
Synonyms:
CHEMBL2179619 US9409858, 5h US9956192, Compound 5h
Type:
Small organic molecule
Emp. Form.:
C23H23N3O3
Mol. Mass.:
389.447
SMILES:
ONC(=O)c1ccc(CN(CCc2ccccc2)C(=O)Nc2ccccc2)cc1
: