Target
Histone deacetylase 1
Ligand
BDBM50398718
Substrate
Meas. Tech.
Inhibition Assay
IC50
1360±450 nM
Citation
 Sotomayor, EMBergman, JAKozikowski, APVillagra, AVWoan, KV Selective histone deactylase 6 inhibitors US Patent  US9751832 Publication Date 9/5/2017 
Target
Name:
Histone deacetylase 1
Synonyms:
Cereblon/Histone deacetylase 1 HDAC1 Histone deacetylase 1 (HDAC1) RPD3L1
Type:
Enzyme
Mol. Mass.:
55090.27
Organism:
Homo sapiens (Human)
Description:
Q13547
Residue:
482
  
Inhibitor
Name:
BDBM50398718
Synonyms:
CHEMBL2179245 US9409858, 8b US9956192, Compound 8b
Type:
Small organic molecule
Emp. Form.:
C19H23N3O4
Mol. Mass.:
357.4036
SMILES:
COCCCN(C(=O)NCc1ccc(cc1)C(=O)NO)c1ccccc1
: