Target
Histone deacetylase 1
Ligand
BDBM50398717
Substrate
Meas. Tech.
Inhibition Assay
IC50
1360±650 nM
Citation
 Sotomayor, EMBergman, JAKozikowski, APVillagra, AVWoan, KV Selective histone deactylase 6 inhibitors US Patent  US9751832 Publication Date 9/5/2017 
Target
Name:
Histone deacetylase 1
Synonyms:
Cereblon/Histone deacetylase 1 HDAC1 Histone deacetylase 1 (HDAC1) RPD3L1
Type:
Enzyme
Mol. Mass.:
55090.27
Organism:
Homo sapiens (Human)
Description:
Q13547
Residue:
482
  
Inhibitor
Name:
BDBM50398717
Synonyms:
CHEMBL2179246 US9409858, 8c US9956192, Compound 8c
Type:
Small organic molecule
Emp. Form.:
C17H19N3O3
Mol. Mass.:
313.3511
SMILES:
CCN(C(=O)NCc1ccc(cc1)C(=O)NO)c1ccccc1
: