Target
Histone deacetylase 6
Ligand
BDBM337657
Substrate
Meas. Tech.
Inhibition Assay
IC50
8.30±n/a nM
Citation
 Sotomayor, EMBergman, JAKozikowski, APVillagra, AVWoan, KV Selective histone deactylase 6 inhibitors US Patent  US9751832 Publication Date 9/5/2017 
Target
Name:
Histone deacetylase 6
Synonyms:
Cereblon/Histone deacetylase 6 HDAC6 Histone deacetylase 6 (HDAC6) KIAA0901 | ORF Names:JM21
Type:
Chromatin regulator; hydrolase; repressor
Mol. Mass.:
131381.51
Organism:
Homo sapiens (Human)
Description:
Q9UBN7
Residue:
1215
  
Inhibitor
Name:
BDBM337657
Synonyms:
US10227295, Compound 9a US9956192, Compound 9a
Type:
Small organic molecule
Emp. Form.:
C16H17N3O4
Mol. Mass.:
315.3239
SMILES:
OCc1ccc(NC(=O)NCc2ccc(cc2)C(=O)NO)cc1
: