Target
Histone deacetylase 6
Ligand
BDBM239060
Substrate
Meas. Tech.
Inhibition Assay
IC50
2.20±n/a nM
Citation
 Sotomayor, EMBergman, JAKozikowski, APVillagra, AVWoan, KV Selective histone deactylase 6 inhibitors US Patent  US9751832 Publication Date 9/5/2017 
Target
Name:
Histone deacetylase 6
Synonyms:
Cereblon/Histone deacetylase 6 HDAC6 Histone deacetylase 6 (HDAC6) KIAA0901 | ORF Names:JM21
Type:
Chromatin regulator; hydrolase; repressor
Mol. Mass.:
131381.51
Organism:
Homo sapiens (Human)
Description:
Q9UBN7
Residue:
1215
  
Inhibitor
Name:
BDBM239060
Synonyms:
US10227295, Compound 9b US9751832, Compound 9b | US9956192, Compound 9b
Type:
Small organic molecule
Emp. Form.:
C15H16N4O3
Mol. Mass.:
300.3125
SMILES:
Cc1ccnc(NC(=O)NCc2ccc(cc2)C(=O)NO)c1
: