Target
Histone deacetylase 1
Ligand
BDBM239061
Substrate
Meas. Tech.
Inhibition Assay
IC50
1000±n/a nM
Citation
 Sotomayor, EMBergman, JAKozikowski, APVillagra, AVWoan, KV Selective histone deactylase 6 inhibitors US Patent  US9751832 Publication Date 9/5/2017 
Target
Name:
Histone deacetylase 1
Synonyms:
Cereblon/Histone deacetylase 1 HDAC1 Histone deacetylase 1 (HDAC1) RPD3L1
Type:
Enzyme
Mol. Mass.:
55090.27
Organism:
Homo sapiens (Human)
Description:
Q13547
Residue:
482
  
Inhibitor
Name:
BDBM239061
Synonyms:
US10227295, Compound 9c US9751832, Compound 9c | US9956192, Compound 9c
Type:
Small organic molecule
Emp. Form.:
C13H14N4O4
Mol. Mass.:
290.2747
SMILES:
Cc1cc(NC(=O)NCc2ccc(cc2)C(=O)NO)no1
: