Target
Histone deacetylase 1
Ligand
BDBM337665
Substrate
Meas. Tech.
Inhibition Assay
IC50
721±n/a nM
Citation
 Sotomayor, EMBergman, JAKozikowski, APVillagra, AVWoan, KV Selective histone deactylase 6 inhibitors US Patent  US9751832 Publication Date 9/5/2017 
Target
Name:
Histone deacetylase 1
Synonyms:
Cereblon/Histone deacetylase 1 HDAC1 Histone deacetylase 1 (HDAC1) RPD3L1
Type:
Enzyme
Mol. Mass.:
55090.27
Organism:
Homo sapiens (Human)
Description:
Q13547
Residue:
482
  
Inhibitor
Name:
BDBM337665
Synonyms:
US10227295, Compound JB7-19 | US9751832, Compound JB7-19
Type:
Small organic molecule
Emp. Form.:
C20H23N5O3
Mol. Mass.:
381.4283
SMILES:
CCCCN(Cc1ccc(cc1)C(=O)NO)C(=O)Nc1ccc2cn[nH]c2c1
: