Target
Histone deacetylase 6
Ligand
BDBM337666
Substrate
Meas. Tech.
Inhibition Assay
IC50
6.12±n/a nM
Citation
 Sotomayor, EMBergman, JAKozikowski, APVillagra, AVWoan, KV Selective histone deactylase 6 inhibitors US Patent  US9751832 Publication Date 9/5/2017 
Target
Name:
Histone deacetylase 6
Synonyms:
Cereblon/Histone deacetylase 6 HDAC6 Histone deacetylase 6 (HDAC6) KIAA0901 | ORF Names:JM21
Type:
Chromatin regulator; hydrolase; repressor
Mol. Mass.:
131381.51
Organism:
Homo sapiens (Human)
Description:
Q9UBN7
Residue:
1215
  
Inhibitor
Name:
BDBM337666
Synonyms:
US10227295, Compound JB7-20 | US9751832, Compound JB7-20
Type:
Small organic molecule
Emp. Form.:
C21H28N4O3
Mol. Mass.:
384.472
SMILES:
CCCCN(Cc1ccc(cc1)C(=O)NO)C(=O)Nc1cccc(c1)N(C)C
: