Target
Transient receptor potential cation channel subfamily A member 1
Ligand
BDBM337816
Substrate
Meas. Tech.
FLIPR Calcium Assay
IC50
>100000±n/a nM
Citation
 Perner, RJKort, MEDiDomenico, SChen, JVasudevan, A TRPA1 antagonists US Patent  US9751850 Publication Date 9/5/2017 
Target
Name:
Transient receptor potential cation channel subfamily A member 1
Synonyms:
ANKTM1 TRPA1 Transformation-sensitive protein p120 | Transient receptor potential cation channel subfamily A member 1 (TRPA1)
Type:
Protein
Mol. Mass.:
127514.20
Organism:
Homo sapiens (Human)
Description:
O75762
Residue:
1119
  
Inhibitor
Name:
BDBM337816
Synonyms:
(1E,3E)-1-(isoquinolin-4-yl)-2-methylpent-1-en-3-one oxime | US9751850, 11
Type:
Small organic molecule
Emp. Form.:
C15H16N2O
Mol. Mass.:
240.3003
SMILES:
CC\C(=N/O)\C(\C)=C\c1cncc2ccccc12
: