Target
Nuclear receptor ROR-gamma
Ligand
BDBM338401
Substrate
Meas. Tech.
Binding Assay
IC50
370±n/a nM
Citation
 Fauber, BGobbi, ARene, Ovan Niel, MBGancia, EGaines, SLadduwahetty, TVesey, DWard, SWinship, P Aryl sultam derivatives as RORc modulators US Patent  US9751873 Publication Date 9/5/2017 
Target
Name:
Nuclear receptor ROR-gamma
Synonyms:
NR1F3 Nuclear receptor ROR-gamma (RORC) RAR-related orphan receptor C (RORc) RORG RZRG Retinoid-related orphan receptor-gamma (RORc)
Type:
Enzyme Catalytic Domain
Mol. Mass.:
58218.40
Organism:
Homo sapiens (Human)
Description:
P51449
Residue:
518
  
Inhibitor
Name:
BDBM338401
Synonyms:
1-[4-[[3-fluoro-4-[[(3S,6R)-3- methyl-1,1-dioxo-6-phenyl- thiazinan-2-yl]methyl]phenyl]- hydroxy-methyl]-1- piperidyl]ethanone | US9751873, Example 89
Type:
Small organic molecule
Emp. Form.:
C26H33FN2O4S
Mol. Mass.:
488.615
SMILES:
C[C@H]1CC[C@H](c2ccccc2)S(=O)(=O)N1Cc1ccc(cc1F)C(O)C1CCN(CC1)C(C)=O
: