Target
Dimer of Gag-Pol polyprotein [501-599,Q508K,L534I,L564I,C568A,C596A]
Ligand
BDBM13933
Substrate
HIV Protease substrate
Meas. Tech.
Protease Inhibition Assay
pH
6.5±n/a
Temperature
310.15±n/a K
Ki
3±n/a nM
Citation
 Martin, JLBegun, JSchindeler, AWickramasinghe, WAAlewood, DAlewood, PFBergman, DABrinkworth, RIAbbenante, GMarch, DRReid, RCFairlie, DP Molecular recognition of macrocyclic peptidomimetic inhibitors by HIV-1 protease. Biochemistry 38:7978-88 (1999)  
Target
Name:
Dimer of Gag-Pol polyprotein [501-599,Q508K,L534I,L564I,C568A,C596A]
Synonyms:
HIV-1 Protease
Type:
Protein Complex
Mol. Mass.:
Description:
Components:
This complex has 2 components.
Component 1
Name:
Gag-Pol polyprotein [501-599,Q508K,L534I,L564I,C568A,C596A]
Synonyms:
HIV-1 Protease chain A gag-pol
Type:
Enzyme Subunit
Mol. Mass.:
10732.11
Organism:
Human immunodeficiency virus type 1
Description:
The HIV-1 protease (Genbank HIVHXB2CG) clone was constructed with the substitutions Q7K, L33I, and L63I, to minimize the autoproteolysis of the protease, and C67A and C95A, to prevent cysteine-thiol oxidation.
Residue:
99
  
Component 2
Name:
Gag-Pol polyprotein [501-599,Q508K,L534I,L564I,C568A,C596A]
Synonyms:
HIV-1 Protease chain A gag-pol
Type:
Enzyme Subunit
Mol. Mass.:
10732.11
Organism:
Human immunodeficiency virus type 1
Description:
The HIV-1 protease (Genbank HIVHXB2CG) clone was constructed with the substitutions Q7K, L33I, and L63I, to minimize the autoproteolysis of the protease, and C67A and C95A, to prevent cysteine-thiol oxidation.
Residue:
99
  
Inhibitor
Name:
BDBM13933
Synonyms:
(2S)-N-[(2S,3R)-4-{[(8S,11S)-8-[(2S)-butan-2-yl]-7,10-dioxo-2-oxa-6,9-diazabicyclo[11.2.2]heptadeca-1(15),13,16-trien-11-yl]amino}-3-hydroxy-1-(4-hydroxyphenyl)butan-2-yl]-3-methyl-2-propanamidobutanamide | Macrocyclic Peptidomimetic Inhibitor 7
Type:
Small organic molecule
Emp. Form.:
C36H53N5O7
Mol. Mass.:
667.8353
SMILES:
CCC(C)[C@@H]1NC(=O)[C@H](Cc2ccc(OCCCNC1=O)cc2)NC[C@@H](O)[C@H](Cc1ccc(O)cc1)NC(=O)[C@@H](NC(=O)CC)C(C)C
:
Substrate
Name:
HIV Protease substrate
Synonyms:
Fluorogenic Peptide Substrate
Type:
Peptide
Mol. Mass.:
3467.28
Organism:
Description:
Residue:
30