Target
Nuclear receptor ROR-gamma
Ligand
BDBM339095
Substrate
Meas. Tech.
RORgammat ThermoFluor Assay
IC50
24.0±n/a nM
Citation
 Leonard, KABarbay, KEdwards, JPKreutter, KDKummer, DAMaharoof, UNishimura, RUrbanski, MVenkatesan, HWang, AWolin, RLWoods, CRFourie, AXue, XCummings, MDMcClure, KTanis, V Quinolinyl modulators of RORγt US Patent  US10201546 Publication Date 2/12/2019 
Target
Name:
Nuclear receptor ROR-gamma
Synonyms:
NR1F3 Nuclear receptor ROR-gamma (RORC) RAR-related orphan receptor C (RORc) RORG RZRG Retinoid-related orphan receptor-gamma (RORc)
Type:
Enzyme Catalytic Domain
Mol. Mass.:
58218.40
Organism:
Homo sapiens (Human)
Description:
P51449
Residue:
518
  
Inhibitor
Name:
BDBM339095
Synonyms:
US10201546, Example 43
Type:
Small organic molecule
Emp. Form.:
C21H21Cl2N5O2S
Mol. Mass.:
478.395
SMILES:
CC(C)Oc1c(Cl)nc2ccc(cc2c1Cl)C(O)(c1cnnn1C)c1sc(C)nc1C
: