Target
Nuclear receptor ROR-gamma
Ligand
BDBM339163
Substrate
Meas. Tech.
RORgammat ThermoFluor Assay
IC50
19.0±n/a nM
Citation
 Leonard, KABarbay, KEdwards, JPKreutter, KDKummer, DAMaharoof, UNishimura, RUrbanski, MVenkatesan, HWang, AWolin, RLWoods, CRFourie, AXue, XCummings, MDMcClure, KTanis, V Quinolinyl modulators of RORγt US Patent  US10201546 Publication Date 2/12/2019 
Target
Name:
Nuclear receptor ROR-gamma
Synonyms:
NR1F3 Nuclear receptor ROR-gamma (RORC) RAR-related orphan receptor C (RORc) RORG RZRG Retinoid-related orphan receptor-gamma (RORc)
Type:
Enzyme Catalytic Domain
Mol. Mass.:
58218.40
Organism:
Homo sapiens (Human)
Description:
P51449
Residue:
518
  
Inhibitor
Name:
BDBM339163
Synonyms:
US10201546, Example 82a
Type:
Small organic molecule
Emp. Form.:
C24H27ClN6O2S
Mol. Mass.:
499.028
SMILES:
CC(C)Oc1c(Cl)c2cc(ccc2nc1N1CCC1)C(O)(c1cnnn1C)c1sc(C)nc1C
: