Target
Nuclear receptor ROR-gamma
Ligand
BDBM339278
Substrate
Meas. Tech.
RORgammat ThermoFluor Assay
IC50
14.0±n/a nM
Citation
 Leonard, KABarbay, KEdwards, JPKreutter, KDKummer, DAMaharoof, UNishimura, RUrbanski, MVenkatesan, HWang, AWolin, RLWoods, CRFourie, AXue, XCummings, MDMcClure, KTanis, V Quinolinyl modulators of RORγt US Patent  US10201546 Publication Date 2/12/2019 
Target
Name:
Nuclear receptor ROR-gamma
Synonyms:
NR1F3 Nuclear receptor ROR-gamma (RORC) RAR-related orphan receptor C (RORc) RORG RZRG Retinoid-related orphan receptor-gamma (RORc)
Type:
Enzyme Catalytic Domain
Mol. Mass.:
58218.40
Organism:
Homo sapiens (Human)
Description:
P51449
Residue:
518
  
Inhibitor
Name:
BDBM339278
Synonyms:
US10201546, Example 136c
Type:
Small organic molecule
Emp. Form.:
C26H28ClN5O2
Mol. Mass.:
477.986
SMILES:
COc1nc2ccc(cc2c(Cl)c1C1CCCC1)[C@@](O)(c1cnnn1C)c1ccc(C)nc1C
: