Target
Nuclear receptor ROR-gamma
Ligand
BDBM339387
Substrate
Meas. Tech.
RORgammat (LBD) Reporter Assay
IC50
18.0±n/a nM
Citation
 Leonard, KABarbay, KEdwards, JPKreutter, KDKummer, DAMaharoof, UNishimura, RUrbanski, MVenkatesan, HWang, AWolin, RLWoods, CRFourie, AXue, XCummings, MDMcClure, KTanis, V Quinolinyl modulators of RORγt US Patent  US10201546 Publication Date 2/12/2019 
Target
Name:
Nuclear receptor ROR-gamma
Synonyms:
NR1F3 Nuclear receptor ROR-gamma (RORC) RAR-related orphan receptor C (RORc) RORG RZRG Retinoid-related orphan receptor-gamma (RORc)
Type:
Enzyme Catalytic Domain
Mol. Mass.:
58218.40
Organism:
Homo sapiens (Human)
Description:
P51449
Residue:
518
  
Inhibitor
Name:
BDBM339387
Synonyms:
US10201546, Example 226c
Type:
Small organic molecule
Emp. Form.:
C25H19F6N5O
Mol. Mass.:
519.4417
SMILES:
CCc1nc2ccc(cc2c(C#N)c1CC(F)(F)F)[C@](O)(c1cncn1C)c1ccnc(c1)C(F)(F)F
: