Target
Amine oxidase [flavin-containing] B
Ligand
BDBM339410
Substrate
Meas. Tech.
Monoamine Oxidase Assays
Ki
550±n/a nM
Citation
 Muñoz, AOCastro-Palomino Laria, JFyfe, MC Lysine specific demethylase-1 inhibitors and their use US Patent  US10202330 Publication Date 2/12/2019 
Target
Name:
Amine oxidase [flavin-containing] B
Synonyms:
AOFB_HUMAN MAOB Monoamine oxidase type B (MAO B) Monoamine oxidase type B (MAOB)
Type:
Protein
Mol. Mass.:
58768.76
Organism:
Homo sapiens (Human)
Description:
P27338
Residue:
520
  
Inhibitor
Name:
BDBM339410
Synonyms:
US10202330, Example 1
Type:
Small organic molecule
Emp. Form.:
C26H27NO2
Mol. Mass.:
385.4981
SMILES:
COc1ccc2CCC(N[C@H]3CC3c3ccc(OCc4ccccc4)cc3)c2c1
: