Target
Amine oxidase [flavin-containing] A
Ligand
BDBM339415
Substrate
Meas. Tech.
Monoamine Oxidase Assays
Ki
20500±n/a nM
Citation
 Muñoz, AOCastro-Palomino Laria, JFyfe, MC Lysine specific demethylase-1 inhibitors and their use US Patent  US10202330 Publication Date 2/12/2019 
Target
Name:
Amine oxidase [flavin-containing] A
Synonyms:
AOFA_HUMAN MAO-A Monoamine oxidase Monoamine oxidase type A (MAO A) Monoamine oxidase type A (MAOA)
Type:
Protein
Mol. Mass.:
59689.53
Organism:
Homo sapiens (Human)
Description:
P21397
Residue:
527
  
Inhibitor
Name:
BDBM339415
Synonyms:
US10202330, Example 6
Type:
Small organic molecule
Emp. Form.:
C18H18ClN
Mol. Mass.:
283.795
SMILES:
Clc1ccc2CCC(N[C@H]3CC3c3ccccc3)c2c1
: