Target
Amine oxidase [flavin-containing] A
Ligand
BDBM339419
Substrate
Meas. Tech.
Monoamine Oxidase Assays
Ki
20500±n/a nM
Citation
 Muñoz, AOCastro-Palomino Laria, JFyfe, MC Lysine specific demethylase-1 inhibitors and their use US Patent  US10202330 Publication Date 2/12/2019 
Target
Name:
Amine oxidase [flavin-containing] A
Synonyms:
AOFA_HUMAN MAO-A Monoamine oxidase Monoamine oxidase type A (MAO A) Monoamine oxidase type A (MAOA)
Type:
Protein
Mol. Mass.:
59689.53
Organism:
Homo sapiens (Human)
Description:
P21397
Residue:
527
  
Inhibitor
Name:
BDBM339419
Synonyms:
US10202330, Example 10
Type:
Small organic molecule
Emp. Form.:
C25H24ClNO
Mol. Mass.:
389.917
SMILES:
COc1ccc2CCC(N[C@H]3CC3c3ccc(cc3)-c3ccc(Cl)cc3)c2c1
: