Target
Amine oxidase [flavin-containing] B
Ligand
BDBM339421
Substrate
Meas. Tech.
Monoamine Oxidase Assays
Ki
20500±n/a nM
Citation
 Muñoz, AOCastro-Palomino Laria, JFyfe, MC Lysine specific demethylase-1 inhibitors and their use US Patent  US10202330 Publication Date 2/12/2019 
Target
Name:
Amine oxidase [flavin-containing] B
Synonyms:
AOFB_HUMAN MAOB Monoamine oxidase type B (MAO B) Monoamine oxidase type B (MAOB)
Type:
Protein
Mol. Mass.:
58768.76
Organism:
Homo sapiens (Human)
Description:
P27338
Residue:
520
  
Inhibitor
Name:
BDBM339421
Synonyms:
US10202330, Example 12
Type:
Small organic molecule
Emp. Form.:
C17H25N
Mol. Mass.:
243.3871
SMILES:
C(CC1CCCCC1)N[C@H]1CC1c1ccccc1
: