Target
Amine oxidase [flavin-containing] A
Ligand
BDBM339423
Substrate
Meas. Tech.
Monoamine Oxidase Assays
Ki
20500±n/a nM
Citation
 Muñoz, AOCastro-Palomino Laria, JFyfe, MC Lysine specific demethylase-1 inhibitors and their use US Patent  US10202330 Publication Date 2/12/2019 
Target
Name:
Amine oxidase [flavin-containing] A
Synonyms:
AOFA_HUMAN MAO-A Monoamine oxidase Monoamine oxidase type A (MAO A) Monoamine oxidase type A (MAOA)
Type:
Protein
Mol. Mass.:
59689.53
Organism:
Homo sapiens (Human)
Description:
P21397
Residue:
527
  
Inhibitor
Name:
BDBM339423
Synonyms:
US10202330, Example 14
Type:
Small organic molecule
Emp. Form.:
C18H27N
Mol. Mass.:
257.4137
SMILES:
C(CC1CCCCCC1)N[C@H]1CC1c1ccccc1
: