Target
Amine oxidase [flavin-containing] B
Ligand
BDBM339424
Substrate
Meas. Tech.
Monoamine Oxidase Assays
Ki
550±n/a nM
Citation
 Muñoz, AOCastro-Palomino Laria, JFyfe, MC Lysine specific demethylase-1 inhibitors and their use US Patent  US10202330 Publication Date 2/12/2019 
Target
Name:
Amine oxidase [flavin-containing] B
Synonyms:
AOFB_HUMAN MAOB Monoamine oxidase type B (MAO B) Monoamine oxidase type B (MAOB)
Type:
Protein
Mol. Mass.:
58768.76
Organism:
Homo sapiens (Human)
Description:
P27338
Residue:
520
  
Inhibitor
Name:
BDBM339424
Synonyms:
US10202330, Example 15
Type:
Small organic molecule
Emp. Form.:
C24H30BrNO
Mol. Mass.:
428.405
SMILES:
Brc1cccc(COc2ccc(cc2)C2C[C@@H]2NCCC2CCCCC2)c1
: