Target
Amine oxidase [flavin-containing] A
Ligand
BDBM339426
Substrate
Meas. Tech.
Monoamine Oxidase Assays
Ki
20500±n/a nM
Citation
 Muñoz, AOCastro-Palomino Laria, JFyfe, MC Lysine specific demethylase-1 inhibitors and their use US Patent  US10202330 Publication Date 2/12/2019 
Target
Name:
Amine oxidase [flavin-containing] A
Synonyms:
AOFA_HUMAN MAO-A Monoamine oxidase Monoamine oxidase type A (MAO A) Monoamine oxidase type A (MAOA)
Type:
Protein
Mol. Mass.:
59689.53
Organism:
Homo sapiens (Human)
Description:
P21397
Residue:
527
  
Inhibitor
Name:
BDBM339426
Synonyms:
US10202330, Example 18
Type:
Small organic molecule
Emp. Form.:
C23H28ClN
Mol. Mass.:
353.928
SMILES:
Clc1ccc(cc1)-c1ccc(cc1)C1C[C@@H]1NCCC1CCCCC1
: