Target
Lysine-specific histone demethylase 1A
Ligand
BDBM339427
Substrate
Meas. Tech.
LSD1 Assay
Ki
550±n/a nM
Citation
 Muñoz, AOCastro-Palomino Laria, JFyfe, MC Lysine specific demethylase-1 inhibitors and their use US Patent  US10202330 Publication Date 2/12/2019 
Target
Name:
Lysine-specific histone demethylase 1A
Synonyms:
AOF2 Flavin-containing amine oxidase domain-containing protein 2 KDM1A KIAA0601 Lysine-specific demethylase 1 (LSD1) Lysine-specific histone demethylase 1 (LSD1)
Type:
Enzyme
Mol. Mass.:
92901.01
Organism:
Homo sapiens (Human)
Description:
O60341
Residue:
852
  
Inhibitor
Name:
BDBM339427
Synonyms:
US10202330, Example 20
Type:
Small organic molecule
Emp. Form.:
C29H33NO2
Mol. Mass.:
427.5778
SMILES:
COc1ccc2CCCC(CCN[C@H]3CC3c3ccc(OCc4ccccc4)cc3)c2c1
: