Target
Ceramide glucosyltransferase
Ligand
BDBM339796
Substrate
Meas. Tech.
WT-MDCK Assay
IC50
23.0±n/a nM
Citation
 Larsen, SDAbe, AShu, LWilson, MWKeep, RFSun, DShayman, JA Glucosylceramide synthase inhibitors and therapeutic methods using the same US Patent  US10202340 Publication Date 2/12/2019 
Target
Name:
Ceramide glucosyltransferase
Synonyms:
CEGT_HUMAN GLCT-1 UDP-glucose ceramide glucosyltransferase UGCG
Type:
PROTEIN
Mol. Mass.:
44859.25
Organism:
Homo sapiens (Human)
Description:
ChEMBL_1435474
Residue:
394
  
Inhibitor
Name:
BDBM339796
Synonyms:
US10202340, Example 16
Type:
Small organic molecule
Emp. Form.:
C25H28F4N2O3
Mol. Mass.:
480.495
SMILES:
O[C@@H]([C@@H](CN1CC[C@@H](F)C1)NC(=O)CC1Cc2ccccc2C1)c1ccc(OC(F)(F)F)cc1
: