Target
Fibroblast growth factor receptor 2
Ligand
BDBM339837
Substrate
Meas. Tech.
FGFR2 (Enzymatic Assay)
IC50
2.14±n/a nM
Citation
 Angibaud, PRObringer, MMarin, JJJeanty, M Naphthyridine derivative compounds US Patent  US9757364 Publication Date 9/12/2017 
Target
Name:
Fibroblast growth factor receptor 2
Synonyms:
BEK FGFR-2 FGFR2 Fibroblast growth factor receptor 2 (FGFR2) KGFR Keratinocyte growth factor receptor VEGF-receptor 2 and Fibroblast growth factor receptor 2
Type:
Enzyme
Mol. Mass.:
92015.45
Organism:
Homo sapiens (Human)
Description:
P21802
Residue:
821
  
Inhibitor
Name:
BDBM339837
Synonyms:
US9757364, Compound 40 | US9757364, Compound 43
Type:
Small organic molecule
Emp. Form.:
C25H25FN6O3
Mol. Mass.:
476.5028
SMILES:
COc1cc(OC)c(F)c(c1)N(CC1CCC(=O)N1)c1ccc2ncc(cc2n1)-c1cnn(C)c1
: