Target
Phosphatidylinositol 3-kinase regulatory subunit alpha
Ligand
BDBM340378
Substrate
Meas. Tech.
Biochemical Assay
Ki
0.026±n/a nM
Citation
 Chen, PCheng, HGallego, GMJalaie, MKath, JCOrr, STPairish, MA Pyrimidine derivatives US Patent  US9758538 Publication Date 9/12/2017 
Target
Name:
Phosphatidylinositol 3-kinase regulatory subunit alpha
Synonyms:
GRB1 PI3-kinase class I PI3-kinase p85-alpha subunit PI3-kinase subunit p85-alpha PIK3CG/PIK3R1 Phosphatidylinositol 3-kinase 85 kDa regulatory subunit alpha (PI3K alpha) Phosphatidylinositol 3-kinase regulatory subunit alpha (PIK3R1) Phosphatidylinositol 3-kinase regulatory subunit alpha isoform 1 (PI3 Kinase alpha) Phosphatidylinositol 4,5-bisphosphate 3-kinase catalytic subunit alpha isoform (PI3Kalpha) PtdIns-3-kinase p85-alpha p85 alpha
Type:
Protein
Mol. Mass.:
83592.82
Organism:
Homo sapiens (Human)
Description:
P27986
Residue:
724
  
Inhibitor
Name:
BDBM340378
Synonyms:
US9758538, Example 66
Type:
Small organic molecule
Emp. Form.:
C22H32N8O4
Mol. Mass.:
472.5407
SMILES:
CC(C)OC(=O)N1CC[C@@](CO)(C1)Nc1cc(nc(n1)N1CCOC[C@@H]1C)-c1cnc(N)nc1
: