Target
Phosphatidylinositol 3-kinase regulatory subunit alpha
Ligand
BDBM340420
Substrate
Meas. Tech.
Biochemical Assay
Ki
0.036±n/a nM
Citation
 Chen, PCheng, HGallego, GMJalaie, MKath, JCOrr, STPairish, MA Pyrimidine derivatives US Patent  US9758538 Publication Date 9/12/2017 
Target
Name:
Phosphatidylinositol 3-kinase regulatory subunit alpha
Synonyms:
GRB1 PI3-kinase class I PI3-kinase p85-alpha subunit PI3-kinase subunit p85-alpha PIK3CG/PIK3R1 Phosphatidylinositol 3-kinase 85 kDa regulatory subunit alpha (PI3K alpha) Phosphatidylinositol 3-kinase regulatory subunit alpha (PIK3R1) Phosphatidylinositol 3-kinase regulatory subunit alpha isoform 1 (PI3 Kinase alpha) Phosphatidylinositol 4,5-bisphosphate 3-kinase catalytic subunit alpha isoform (PI3Kalpha) PtdIns-3-kinase p85-alpha p85 alpha
Type:
Protein
Mol. Mass.:
83592.82
Organism:
Homo sapiens (Human)
Description:
P27986
Residue:
724
  
Inhibitor
Name:
BDBM340420
Synonyms:
US9758538, Example 108
Type:
Small organic molecule
Emp. Form.:
C22H31FN8O3
Mol. Mass.:
474.5317
SMILES:
CC(C)(C)OC(=O)N1CC[C@@](C)(C1)Nc1nc(nc(c1F)-c1cnc(N)nc1)N1CCOCC1
: