Target
Indoleamine 2,3-dioxygenase 1
Ligand
BDBM340805
Substrate
Meas. Tech.
IDO Kynurenine Assay
IC50
290±n/a nM
Citation
 Markwalder, JASeitz, SPBalog, JAHuang, AMandal, SKWilliams, DKHart, ACInghrim, J IDO inhibitors US Patent  US9765018 Publication Date 9/19/2017 
Target
Name:
Indoleamine 2,3-dioxygenase 1
Synonyms:
I23O1_HUMAN IDO-1 INDO Indoleamine 2,3-dioxygenase | Indoleamine-pyrrole 2,3-dioxygenase
Type:
Enzyme
Mol. Mass.:
45330.80
Organism:
Homo sapiens (Human)
Description:
P14902
Residue:
403
  
Inhibitor
Name:
BDBM340805
Synonyms:
4-methoxy-4'- (naphthalen-1-yloxy)-3'- (3-o-tolylureido)biphenyl- 3-carboxylic acid | US9765018, Example 129
Type:
Small organic molecule
Emp. Form.:
C32H26N2O5
Mol. Mass.:
518.5592
SMILES:
COc1ccc(cc1C(O)=O)-c1ccc(Oc2cccc3ccccc23)c(NC(=O)Nc2ccccc2C)c1
: