Target
Calmodulin-domain protein kinase 1
Ligand
BDBM50345731
Substrate
Meas. Tech.
Biological Assay
IC50
9.00±n/a nM
Citation
 Van Voorhis, WCHol, WGLarson, ETMaly, DJMerritt, EOjo, KK Compositions and methods for treating toxoplasmosis, cryptosporidiosis, and other apicomplexan protozoan related diseases US Patent  US9765037 Publication Date 9/19/2017 
Target
Name:
Calmodulin-domain protein kinase 1
Synonyms:
Calmodulin-domain protein kinase 1 Calmodulin-domain protein kinase, putative
Type:
Enzyme Catalytic Domain
Mol. Mass.:
57248.42
Organism:
Toxoplasma gondii
Description:
Residue:
507
  
Inhibitor
Name:
BDBM50345731
Synonyms:
3-(4-fluoro-3-methylphenyl)-1-isopropyl-1H-pyrazolo[3,4-d]pyrimidin-4-amine US10544104, Compound 7i US9765037, Compound 7i
Type:
Small organic molecule
Emp. Form.:
C15H16FN5
Mol. Mass.:
285.3194
SMILES:
CC(C)n1nc(-c2ccc(F)c(C)c2)c2c(N)ncnc12
: