Target
Calcium-dependent protein kinase 1
Ligand
BDBM340881
Substrate
Meas. Tech.
Biological Assay
IC50
7.80±n/a nM
Citation
 Van Voorhis, WCHol, WGLarson, ETMaly, DJMerritt, EOjo, KK Compositions and methods for treating toxoplasmosis, cryptosporidiosis, and other apicomplexan protozoan related diseases US Patent  US9765037 Publication Date 9/19/2017 
Target
Name:
Calcium-dependent protein kinase 1
Synonyms:
Calcium-dependent protein kinase 1 (CDPK1)
Type:
Protein
Mol. Mass.:
76617.33
Organism:
Cryptosporidium parvum
Description:
Q6S4W0
Residue:
677
  
Inhibitor
Name:
BDBM340881
Synonyms:
3-isopropyl-1-(naphthalen-2-yl)imidazo[1,5- a]pyrazin-8-amine US11247972, Compound 8 | US9765037, Compound 8
Type:
Small organic molecule
Emp. Form.:
C19H18N4
Mol. Mass.:
302.373
SMILES:
CC(C)c1nc(-c2ccc3ccccc3c2)c2c(N)nccn12
: