Target
Epidermal growth factor receptor
Ligand
BDBM202370
Substrate
Meas. Tech.
Biochemical Assay
IC50
200±n/a nM
Citation
 Lee, KNiu, DPetter, RCSingh, J Heteroaryl compounds and uses thereof US Patent  US9765038 Publication Date 9/19/2017 
Target
Name:
Epidermal growth factor receptor
Synonyms:
EGF Receptor Substrate EGFR_HUMAN ERBB1 Epidermal Growth Factor Receptor erbB-1 Epidermal growth factor receptor (EGFR) HER1 Proto-oncogene c-ErbB-1 Tyrosine-Protein Kinase ErbB-1
Type:
Receptor Kinase Domain
Mol. Mass.:
134279.59
Organism:
Homo sapiens (Human)
Description:
P00533
Residue:
1210
  
Inhibitor
Name:
BDBM202370
Synonyms:
US10081606, Compound I-2 US9765038, Compound I-2
Type:
Small organic molecule
Emp. Form.:
C21H17F3N4O3
Mol. Mass.:
430.3799
SMILES:
COc1ccccc1Nc1ncc(c(Oc2cccc(NC(=O)C=C)c2)n1)C(F)(F)F
: